{"text_format":"1","workbook":"xlsx","n_sheets":9,"sheets":["Instructions","General","C1 - Genuine and Specialised","C2 - Limited","C3 - Governance","Courses & Commencements","Validation (Do not use)","Funded Course List (Do not use)","Sheet1"],"not_rendered":{"charts":0,"images":18,"macros":1,"external_links":0,"defined_names":5,"comments":0,"pivot_tables":0},"unopened":[],"bounds":{"document_bytes":16777216,"sheet_cells":100000,"rows_first":2000,"rows_last":500,"rows_between":2000,"halvings":0,"cell_chars":16384,"cell_head_chars":4096},"cells_cut":0,"cells_raw":0,"read":"whole","date_system":"1900"}

{"sheet":"Instructions","index":0,"n_rows":1,"n_cols":1,"rows_kept":1,"cut":false,"hidden":false,"merged":[[0,0,34,22]]}
["To complete this application you must complete all PURPLE tabs:\n\n1. General tab\n2. C1 - Genuine  and Specialised tab\n3. C2 - Limited tab\n4. C3 - Governance tab\n5. Courses and commencements tab\n\nYou will need to click \"Enable Content\" for the form to work correctly\n\nPlease submit this form along with a scanned copy of the completed ‘Subcontractor’s Declaration – 2020’ form (available in the Documents section of SVTS) signed by the CEO or Authorised Delegate of the proposed subcontractor via an SVTS Enquiry. Please use the Enquiry subject header 'Skills First VET Funding Contract - Subcontracting of Training Services'.\n\nFor further information and guidance about how to complete a subcontracting application, please refer to:\n- Contract Notification 2019-21 (available the Memos section of SVTS); and  \n- the Fact Sheet 'Subcontracting of Training and Assessment: 2020 request for approval'  (available in the Documents Section of SVTS).\n"]

{"sheet":"General","index":1,"n_rows":18,"n_cols":6,"rows_kept":18,"cut":false,"hidden":false,"merged":[[0,5,0,6],[9,4,11,4],[12,5,12,6],[13,5,13,6],[14,5,14,6],[13,0,15,0],[13,1,15,1],[1,4,2,6],[3,5,3,6],[4,5,4,6],[5,5,6,6],[7,5,8,6],[11,0,12,1],[5,0,7,0],[5,4,6,4],[7,4,8,4],[1,0,2,2],[3,1,3,2],[4,1,4,2],[8,1,8,2],[9,1,9,2]]}
[]
["Your Training Provider",null,null,null,"Proposed Subcontractor"]
[]
["Your Training Provider's TOID:",null,null,null,"Proposed subcontractor organisation name:"]
["Your Training Provider's Legal Name",null,null,null,"Proposed subcontractor ABN (number without spaces)"]
["NAME OF AUTHORISED DELEGATE:  An Authorised Delegate is the Training Provider’s CEO, or equivalent, or a staff member who has been given express delegation to sign the declaration on the CEO’s behalf.","Title",null,null,"Is the proposed subcontractor a Registered Training Provider?   (yes/no)"]
[null,"First Name"]
[null,"Last Name",null,null,"If the proposed subcontractor organisation is a Registered Training Provider, provide the TOID: "]
["Your Training Provider's Authorised Delegate's Position:"]
["Your Training Provider's Contact Phone Number: ",null,null,null,"Proposed subcontractor key contact name:","Title"]
[null,null,null,null,null,"First Name"]
[" Declaration of Training Provider Authorised Delegate",null,null,null,null,"Last Name"]
[null,null,null,null,"Proposed subcontractor key contact job title:"]
["By inserting an “X” in the box to the right, I, the Training Provider Authorised Delegate, declare that I have read and understood that my Training Provider’s obligations under its VET Funding Contract are never diminished where services are subcontracted (Clause 6.11(c)) and I confirm that I will maintain appropriate governance and oversight to support these obligations. I warrant that, having completed my own due diligence, the proposed subcontractor has sufficient expertise and capacity to support my Training Provider to meet its obligations under its VET Funding Contract.",null,null,null,"Proposed subcontractor key contact phone number"]
[null,null,null,null,"Proposed subcontractor website"]
[]
["By inserting an \"X\" in the box to the right, I, the Training Provider's Authorised Delegate, declare that:\n- the information provided in this form is true and correct,\n- that I have reviewed the information provided by the proposed subcontractor via the ‘Subcontractor’s Declaration – 2020’ form and can confirm that, to the best of my knowledge, it is true and correct, and\n- I understand that the Department has absolute discretion in approving, approving in part, or not approving this subcontracting application.\n"]
["Date of Declaration:",null,"20/11/2019"]

{"sheet":"C1 - Genuine and Specialised","index":2,"n_rows":41,"n_cols":13,"rows_kept":41,"cut":false,"hidden":false,"merged":[[42,1,49,10],[42,12,49,21],[3,0,3,21],[30,12,31,21],[40,1,41,10],[40,12,41,21],[10,0,49,0],[12,1,19,10],[12,12,19,21],[22,1,29,10],[22,12,29,21],[32,1,39,10],[32,12,39,21],[10,1,11,10],[20,1,21,10],[20,12,21,21],[10,12,11,21],[30,1,31,10],[5,1,8,10],[5,12,8,21],[0,0,0,1],[1,0,1,1],[0,2,0,3],[1,2,1,3],[5,0,8,0]]}
["Training Provider TOID",null,{"$f":"IF(General!B4 >0, General!B4, \"\")","v":""}]
["Subcontractor ABN",null,{"$f":"IF(General!F5 >0, General!F5, \"\")","v":""}]
[]
["Criterion 1 - Genuine and Specialised"]
[]
["Question","Question 1: How does the proposed subcontracting arrangement address a critical need and/or existing labour market demand for the training?",null,null,null,null,null,null,null,null,null,null,"Question 2: Why can’t the proposed training and assessment for subcontracting be delivered directly by the Training Provider? Please provide details in the relevant section(s) below about\na) why your organisation can't deliver the training\nb) how the subcontractor will address this need"]
[]
[]
[]
[]
["RTO Response (please ensure you address each aspect of the criterion)","What is the critical need and/or existing labour market demand for the training?",null,null,null,null,null,null,null,null,null,null,"What are the capacity issues affecting your organisation's ability to deliver the training, and how will this be addressed by the subcontractor?"]
[]
[]
[]
[]
[]
[]
[]
[]
[]
[null,"How does the proposed training delivery address this critical need or demand?",null,null,null,null,null,null,null,null,null,null,"What are the specialist skills/experience your organisation lacks and how will this be addressed by the subcontractor? Include relevant skills and qualifications of the subcontractor."]
[]
[]
[]
[]
[]
[]
[]
[]
[]
[null,"What career pathways or job opportunities would the proposed training delivery provide for students? Please provide supporting evidence such as letters from employers or industry engagement",null,null,null,null,null,null,null,null,null,null,"What infrastructure does your organisation lack, and how will this be addressed by the subcontractor?"]
[]
[]
[]
[]
[]
[]
[]
[]
[]
[null,"Are there any other relevant details?",null,null,null,null,null,null,null,null,null,null,"Are there any other limitations on your organisation delivering the training, and how will these be addressed by the subcontractor?"]

{"sheet":"C2 - Limited","index":3,"n_rows":41,"n_cols":13,"rows_kept":41,"cut":false,"hidden":false,"merged":[[22,12,29,21],[20,12,21,21],[12,12,19,21],[10,12,11,21],[30,12,31,21],[32,12,39,21],[40,1,41,10],[40,12,41,21],[42,1,49,10],[42,12,49,21],[10,0,49,0],[10,1,11,10],[12,1,19,10],[20,1,21,10],[22,1,29,10],[30,1,31,10],[32,1,39,10],[5,0,8,0],[5,1,8,10],[5,12,8,21],[0,0,0,1],[0,2,0,3],[1,0,1,1],[1,2,1,3],[3,0,3,21]]}
["Training Provider TOID",null,{"$f":"IF(General!B4 >0, General!B4, \"\")","v":""}]
["Subcontractor ABN",null,{"$f":"IF(General!F5 >0, General!F5, \"\")","v":""}]
[]
["Criterion 2 - Limited"]
[]
["Question","Question 3: What is the student cohort your organisation is targeting? Please provide details in the relevant sections below.",null,null,null,null,null,null,null,null,null,null,"Question 4:  How will the delivery of the program be limited? Applications for delivery of an entire program by a subcontractor will only be approved where there are exceptional circumstances and approval would be in the interests of students"]
[]
[]
[]
[]
["RTO Response (please ensure you address each aspect of the criterion)","What are the characteristics of the student cohort?",null,null,null,null,null,null,null,null,null,null,"Will the delivery of the program be shared between the subcontractor and your organisation? Please provide details below. "]
[]
[]
[]
[]
[]
[]
[]
[]
[]
[null,"What is the anticipated size of the student cohort, and why?",null,null,null,null,null,null,null,null,null,null,"If the delivery of the program will not be shared between the subcontractor and your organisation, provide details about why there are exceptional circumstances and why approval would be in the interests of students."]
[]
[]
[]
[]
[]
[]
[]
[]
[]
[null,"When do you anticipate the training will be delivered, and why?",null,null,null,null,null,null,null,null,null,null,"Will the delivery be limited to a specific region or area? If yes, provide details."]
[]
[]
[]
[]
[]
[]
[]
[]
[]
[null,"Are there any other relevant details?",null,null,null,null,null,null,null,null,null,null,"Are there any other relevant details?"]

{"sheet":"C3 - Governance","index":4,"n_rows":41,"n_cols":3,"rows_kept":41,"cut":false,"hidden":false,"merged":[[42,1,49,10],[3,0,3,10],[22,1,29,10],[30,1,31,10],[32,1,39,10],[5,0,8,0],[5,1,8,10],[10,0,49,0],[10,1,11,10],[12,1,19,10],[20,1,21,10],[0,0,0,1],[0,2,0,3],[1,0,1,1],[1,2,1,3],[40,1,41,10]]}
["Training Provider TOID",null,{"$f":"IF(General!B4 >0, General!B4, \"\")","v":""}]
["Subcontractor ABN",null,{"$f":"IF(General!F5 >0, General!F5, \"\")","v":""}]
[]
["Criterion 3 - Governance"]
[]
["Question","Question 5: How will your organisation ensure appropriate oversight and control over the subcontractor?"]
[]
[]
[]
[]
["RTO Response (please ensure you address each aspect of the criterion)","What is the frequency and mode of contact with the subcontractor?"]
[]
[]
[]
[]
[]
[]
[]
[]
[]
[null,"How will the quality of training services delivered by the subcontractor be monitored?"]
[]
[]
[]
[]
[]
[]
[]
[]
[]
[null,"How will data about the subcontractor's delivery of training services be collected and validated?"]
[]
[]
[]
[]
[]
[]
[]
[]
[]
[null,"What procedures will be implemented to ensure accurate and consistent reporting of subcontracted delivery of training services"]

{"sheet":"Courses & Commencements","index":5,"n_rows":67,"n_cols":33,"rows_kept":67,"cut":false,"hidden":false,"merged":[[0,0,0,1],[15,8,15,14],[18,6,37,6],[0,2,0,3],[1,0,1,1],[1,2,1,3],[3,0,13,14],[16,0,16,2],[16,8,16,10],[0,12,2,13],[0,14,2,14],[15,0,15,6],[16,3,16,6],[16,11,16,14],[18,14,37,14],[18,8,37,8],[66,3,85,3],[66,8,85,8],[63,0,63,6],[63,8,63,14],[39,0,39,6],[39,8,39,14],[66,9,85,9],[66,10,85,10],[66,11,85,11],[40,0,40,2],[40,8,40,10],[42,0,61,0],[66,0,85,0],[66,1,85,1],[66,2,85,2],[42,1,61,1],[18,9,37,9],[18,10,37,10],[18,11,37,11],[18,0,37,0],[18,1,37,1],[18,2,37,2],[18,3,37,3],[66,6,85,6],[66,14,85,14],[42,2,61,2],[64,0,64,2],[40,3,40,6],[40,11,40,14],[64,3,64,6],[64,11,64,14],[42,10,61,10],[42,11,61,11],[42,3,61,3],[42,8,61,8],[42,9,61,9],[64,8,64,10],[42,14,61,14],[42,6,61,6]]}
["Training Provider TOID",null,{"$f":"IF(General!B4 >0, General!B4, \"\")","v":""},null,null,null,null,null,null,null,null,null,"Total requested commencements (auto-calculated)",null,{"$f":"D19+L19+D43+L43+D67+L67","v":0}]
["Subcontractor ABN",null,{"$f":"IF(General!F5 >0, General!F5, \"\")","v":""}]
[]
["Note that Training Providers may not subcontract more than 40% of their Commencement Allocation, up to a maximum of 1,000 commencements.  Also note that individual subcontractors may provide training/assessment to a maximum of 200 Skills First subsidised commencements across all Training Providers per year (i.e. 200 aggregate). This commencement limit on individual subcontractors extends to all Related Entities of a subcontractor as discussed in the Fact Sheet: 'Subcontracting of Training and Assessment: 2020 request for approval'.\n\nAs such, the total number of commencements sought via this application form must not exceed 200. Where arrangements with a particular subcontractor are sought at an individual Training Provider or across multiple Training Providers in excess of this 200 commencement limit, the Department will determine at its sole discretion how many commencements (if any) are approved at a particular Training Provider and/or subcontractor."]
[]
[]
[]
[]
[]
[]
[]
[]
[]
[]
[null,null,null,null,null,null,1,null,null,null,null,null,null,null,1]
["Course 1",null,null,null,null,null,null,null,"Course 2"]
["How is the delivery limited? MUST CHOOSE ONE OPTION ------------------->",null,null,"Please select",null,null,null,null,"How is the delivery limited? MUST CHOOSE ONE OPTION ------------------->",null,null,"Please select"]
["Course Code","Course Name","Enrolment Type","Requested commencements in 2020 (this is a strict limit, not a guide)","If shared delivery list units to be deliverered by RTO (unit code)","If shared delivery list units to be delivered by subcontractor (unit code)","If regional delivery list postcode",null,"Course Code","Course Name","Enrolment Type","Requested commencements in 2020 (this is a strict limit, not a guide)","If shared delivery list units to be deliverered by RTO (unit code)","If shared delivery list units to be delivered by subcontractor (unit code)","If regional delivery list postcode"]
[null,{"$f":"IF(A19<>\"\", VLOOKUP(A19,'Funded Course List (Do not use)'!A1:B925,2,FALSE),\"\")","v":""},null,null,null,null,null,null,null,{"$f":"IF(I19<>\"\", VLOOKUP(I19,'Funded Course List (Do not use)'!A1:B925,2,FALSE),\"\")","v":""}]
[null,null,null,null,null,null,null,null,null,null,null,null,null,null,null,null,null,null,null,null,null,null,null,null,null,null,null,null,null,null,null,null,"Column1"]
[null,null,null,null,null,null,null,null,null,null,null,null,null,null,null,null,null,null,null,null,null,null,null,null,null,null,null,null,null,null,null,null,"Please select"]
[null,null,null,null,null,null,null,null,null,null,null,null,null,null,null,null,null,null,null,null,null,null,null,null,null,null,null,null,null,null,null,null,"Shared delivery - some units delivered by RTO and some by Subcontractor - list unit breakdown below"]
[null,null,null,null,null,null,null,null,null,null,null,null,null,null,null,null,null,null,null,null,null,null,null,null,null,null,null,null,null,null,null,null,"Region - subcontractor delivers entire program in a specific region - list postcode below"]
[null,null,null,null,null,null,null,null,null,null,null,null,null,null,null,null,null,null,null,null,null,null,null,null,null,null,null,null,null,null,null,null,"Other - other limitation (provide details in Criterion 2 tab)"]
[]
[]
[]
[]
[]
[]
[]
[]
[]
[]
[]
[]
[]
[]
[null,null,null,null,null,null,1,null,null,null,null,null,null,null,1]
["Course 3",null,null,null,null,null,null,null,"Course 4"]
["How is the delivery limited? MUST CHOOSE ONE OPTION ------------------->",null,null,"Please select",null,null,null,null,"How is the delivery limited? MUST CHOOSE ONE OPTION ------------------->",null,null,"Please select"]
["Course Code","Course Name","Enrolment Type","Requested commencements in 2020 (this is a strict limit, not a guide)","If shared delivery list units to be deliverered by RTO (unit code)","If shared delivery list units to be delivered by subcontractor (unit code)","If regional delivery list postcode",null,"Course Code","Course Name","Enrolment Type","Requested commencements in 2020 (this is a strict limit, not a guide)","If shared delivery list units to be deliverered by RTO (unit code)","If shared delivery list units to be delivered by subcontractor (unit code)","If regional delivery list postcode"]
[null,{"$f":"IF(A43<>\"\", VLOOKUP(A43,'Funded Course List (Do not use)'!A1:B925,2,FALSE),\"\")","v":""},null,null,null,null,null,null,null,{"$f":"IF(I43<>\"\", VLOOKUP(I43,'Funded Course List (Do not use)'!A1:B925,2,FALSE),\"\")","v":""}]
[]
[]
[]
[]
[]
[]
[]
[]
[]
[]
[]
[]
[]
[]
[]
[]
[]
[]
[]
[null,null,null,null,null,null,1,null,null,null,null,null,null,null,2]
["Course 5",null,null,null,null,null,null,null,"Course 6"]
["How is the delivery limited? MUST CHOOSE ONE OPTION ------------------->",null,null,"Please select",null,null,null,null,"How is the delivery limited? MUST CHOOSE ONE OPTION ------------------->",null,null,"Please select"]
["Course Code","Course Name","Enrolment Type","Requested commencements in 2020 (this is a strict limit, not a guide)","If shared delivery list units to be deliverered by RTO (unit code)","If shared delivery list units to be delivered by subcontractor (unit code)","If regional delivery list postcode",null,"Course Code","Course Name","Enrolment Type","Requested commencements in 2020 (this is a strict limit, not a guide)","If shared delivery list units to be deliverered by RTO (unit code)","If shared delivery list units to be delivered by subcontractor (unit code)","If regional delivery list postcode"]
[null,{"$f":"IF(A67<>\"\", VLOOKUP(A67,'Funded Course List (Do not use)'!A1:B925,2,FALSE),\"\")","v":""},null,null,null,null,null,null,null,{"$f":"IF(I67<>\"\", VLOOKUP(I67,'Funded Course List (Do not use)'!A1:B925,2,FALSE),\"\")","v":""}]

{"sheet":"Validation (Do not use)","index":6,"n_rows":11,"n_cols":4,"rows_kept":11,"cut":false,"hidden":true,"merged":[]}
[]
["Yes","X",null,"Non-apprenticeship/traineeship"]
["No",null,null,"Traineeship"]
[null,null,null,"Apprenticeship"]
[]
[]
[]
[null,null,null,"Please select"]
[null,null,null,"Shared delivery - some units delivered by RTO and some by Subcontractor - list unit breakdown below"]
[null,null,null,"Region - subcontractor delivers entire program in a specific region - list postcode below"]
[null,null,null,"Other - other limitation (provide details in Criterion 2 tab)"]

{"sheet":"Funded Course List (Do not use)","index":7,"n_rows":813,"n_cols":2,"rows_kept":813,"cut":false,"hidden":true,"merged":[]}
["10064NAT","Diploma of Fashion Styling"]
["10190NAT","Certificate III in Learning an Endangered Aboriginal Language"]
["10191NAT","Certificate IV in Teaching an Endangered Aboriginal Language"]
["10614NAT","Diploma of Wine Technology"]
["10678NAT","Advanced Diploma of Professional Screenwriting"]
["10695NAT","Certificate IV in TESOL (Teaching English to Speakers of Other Languages)"]
["10702NAT","Advanced Diploma of Professional Game Development"]
["10725NAT","Course in Preliminary Spoken and Written English"]
["10727NAT","Certificate I in Spoken and Written English"]
["10728NAT","Certificate II in Spoken and Written English"]
["10729NAT","Certificate III in Spoken and Written English"]
["10730NAT","Certificate IV in Spoken and Written English for Further Study"]
["22272VIC","Course in Pyrometric Requirements for Thermal Processing"]
["22273VIC","Diploma of Agronomy"]
["22274VIC","Certificate IV in Clinical Classification"]
["22276VIC","Advanced Diploma of Legal Practice"]
["22277VIC","Course in Aboriginal Hospital Liaison Officer (Acute Health Setting)"]
["22279VIC","Advanced Diploma of International Business"]
["22283VIC","Advanced Diploma of Business (Public Relations)"]
["22284VIC","Diploma of Business (Public Relations)"]
["22285VIC","Certificate II in Signage and Graphics"]
["22290VIC","Diploma of Equine Podiotherapy"]
["22293VIC","Certificate I in Initial Adult Literacy and Numeracy"]
["22294VIC","Course in Initial Adult Literacy and Numeracy"]
["22298VIC","Course in Basic Oxygen Administration"]
["22300VIC","Course in First Aid Management of Anaphylaxis"]
["22301VIC","Certificate I in Transition Education"]
["22302VIC","Certificate I in Work Education"]
["22303VIC","Course in Verifying the Correct Use of Adrenaline Autoinjector Devices"]
["22304VIC","Certificate II in Plumbing (Pre-apprenticeship)"]
["22306VIC","Certificate IV in Musical Instrument Making and Repair"]
["22312VIC","Course in the Use of Carbon Fibre in Composite Manufacturing"]
["22313VIC","Certificate IV in Tertiary Preparation"]
["22315VIC","Diploma of Theatre Arts"]
["22316VIC","Advanced Diploma of Myotherapy"]
["22317VIC","Certificate IV in Liberal Arts"]
["22319VIC","Course in Supported Playgroup Facilitation"]
["22320VIC","Diploma of Justice"]
["22321VIC","Advanced Diploma of Justice"]
["22324VIC","Certificate IV in Electrical Inspection"]
["22325VIC","Course in Workplace Spotting for Service Assets"]
["22329VIC","Course in Heating, Ventilation and Air Conditioning Services"]
["22331VIC","Certificate IV in Landscape Design"]
["22333VIC","Certificate I in Developing Independence"]
["22334VIC","Certificate IV in Cyber Security"]
["22338VIC","Certificate II in Building and Construction Pre-apprenticeship"]
["22339VIC","Certificate II in Greengrocery"]
["22340VIC","Certificate III in Greengrocery"]
["22441VIC","Certificate III in Science"]
["22442VIC","Certificate IV in Science"]
["22445VIC","Advanced Diploma of Cyber Security"]
["22446VIC","Diploma of Product Design"]
["22447VIC","Certificate I in Mumgu-dhal tyama-tiyt"]
["22448VIC","Certificate II in Mumgu-dhal tyama-tiyt"]
["22449VIC","Certificate III in Mumgu-dhal tyama-tiyt"]
["22450VIC","Course in Pharmaceutical Manufacturing Principles"]
["22451VIC","Diploma of Teacher Education Preparation"]
["22453VIC","Course in New Energy Technology Systems"]
["22458VIC","Diploma of Railway Signalling Systems"]
["22460VIC","Diploma of Applied Technologies"]
["22461VIC","Course in Fusion Welding to ISO 9606 for Transition Workers"]
["22462VIC","Course in Fusion Welding to ISO 9606 for Experienced Welders"]
["22464VIC","Certificate II in Ecology"]
["22465VIC","Certificate III in Ecology"]
["22466VIC","Diploma of Ecology"]
["22467VIC","Course in Transport and Logistics Employment Pathway"]
["22468VIC","Course in Civil Construction Pathway"]
["22469VIC","Course in Introduction to the National Disability Insurance Scheme"]
["22470VIC","Certificate II in Engineering Studies"]
["22471VIC","Course in Initial General Education for Adults"]
["22472VIC","Certificate I in General Education for Adults"]
["22473VIC","Certificate II in General Education for Adults"]
["22474VIC","Certificate III in General Education for Adults"]
["22476VIC","Certificate I in General Education for Adults (Introductory)"]
["22477VIC","Advanced Diploma of Building Design (Architectural)"]
["22478VIC","Diploma of Engineering Technology"]
["22479VIC","Advanced Diploma of Engineering Technology"]
["22480VIC","Certificate II in Small Business (Operations/Innovation)"]
["22481VIC","Certificate II in Work Education"]
["22482VIC","Course in Initial EAL"]
["22483VIC","Course in EAL"]
["22484VIC","Certificate I in EAL (Access)"]
["22485VIC","Certificate II in EAL (Access)"]
["22486VIC","Certificate III in EAL (Access)"]
["22487VIC","Certificate IV in EAL (Access)"]
["22488VIC","Certificate II in EAL (Employment)"]
["22489VIC","Certificate III in EAL (Employment)"]
["22490VIC","Certificate IV in EAL (Employment / Professional)"]
["22491VIC","Certificate III in EAL (Further Study)"]
["22492VIC","Certificate IV in EAL (Further Study)"]
["22499VIC","Certificate II in Electrotechnology (Pre-vocational)"]
["22503VIC","Course in Providing Support to People Using Ventilators and C-PAP Machines"]
["22505VIC","Course in Multi-disciplinary Design"]
["22509VIC","Diploma of Electrotechnology Project Management"]
["22510VIC","Course in Identifying and Responding to Family Violence Risk"]
["22512VIC","Course in Policing Recruitment Pathway"]
["22513VIC","Certificate III in Equine Studies"]
["22516VIC","Course in Minimising Risks in the Use of 1080 & PAPP Bait Products for Vertebrate Pest Control"]
["22519VIC","Certificate IV in Integrated Technologies"]
["22520VIC","Course in Skylight Installation and Repair"]
["52722WA","Certificate IV in Health Science Foundations"]
["ACM20117","Certificate II in Animal Studies"]
["ACM20217","Certificate II in Horse Care"]
["ACM30117","Certificate III in Animal Studies"]
["ACM30217","Certificate III in Animal Technology"]
["ACM30317","Certificate III in Captive Animals"]
["ACM30417","Certificate III in Companion Animal Services"]
["ACM30617","Certificate III in Pet Grooming"]
["ACM30717","Certificate III in Horse Breeding"]
["ACM30817","Certificate III in Performance Horse"]
["ACM40117","Certificate IV in Animal Control and Regulation"]
["ACM40317","Certificate IV in Companion Animal Services"]
["ACM40418","Certificate IV in Veterinary Nursing"]
["ACM40617","Certificate IV in Pet Styling"]
["ACM40717","Certificate IV in Horse Breeding"]
["ACM40818","Certificate IV in Farriery"]
["ACM50117","Diploma of Animal Technology"]
["ACM50317","Diploma of Horse Stud Management"]
["ACM50412","Diploma of Veterinary Nursing (Emergency and Critical Care)"]
["ACM50512","Diploma of Veterinary Nursing (General Practice)"]
{"$rows_left_out":694}
{"sheet":"Sheet1","index":8,"n_rows":5,"n_cols":1,"rows_kept":5,"cut":false,"hidden":true,"merged":[]}
["Column1"]
["Please select"]
["Shared delivery - some units delivered by RTO and some by Subcontractor - list unit breakdown below"]
["Region - subcontractor delivers entire program in a specific region - list postcode below"]
["Other - other limitation (provide details in Criterion 2 tab)"]